{"text_format":"1","workbook":"xlsx","n_sheets":8,"sheets":["Aktiver makroer","Forside","Rediger","Øvrige Krav","Øvrige_Krav_DATA","Faglige kompetencekrav","Fagkompetence_DATA","Versionshistorik"],"not_rendered":{"charts":0,"images":8,"macros":1,"external_links":0,"defined_names":5,"comments":0,"pivot_tables":0},"unopened":[],"bounds":{"document_bytes":16777216,"sheet_cells":100000,"rows_first":2000,"rows_last":500,"rows_between":2000,"halvings":0,"cell_chars":16384,"cell_head_chars":4096},"cells_cut":0,"cells_raw":0,"read":"whole","date_system":"1900"}

{"sheet":"Aktiver makroer","index":0,"n_rows":0,"n_cols":0,"rows_kept":0,"cut":false,"hidden":false,"merged":[]}

{"sheet":"Forside","index":1,"n_rows":36,"n_cols":6,"rows_kept":36,"cut":false,"hidden":true,"merged":[[32,5,32,6],[11,1,11,4],[11,11,11,14],[21,1,21,4],[21,6,21,9],[21,11,21,14]]}
[]
["Opslagskatalog over jernbanesikkerhedsmæssige, tekniske og forretningsmæssige krav"]
[]
[]
[]
[]
[]
[]
[]
[]
[]
[]
[]
[]
[]
[]
[]
[]
[]
[]
{"$rows_left_out":17}
{"sheet":"Rediger","index":2,"n_rows":36,"n_cols":6,"rows_kept":36,"cut":false,"hidden":true,"merged":[[32,5,32,6]]}
[]
["Opslagskatalog over jernbanesikkerhedsmæssige, tekniske og forretningsmæssige krav"]
[]
[]
[]
[]
[]
[]
[]
[]
[]
[]
[]
[]
[]
[]
[]
[]
[]
[]
{"$rows_left_out":17}
{"sheet":"Øvrige Krav","index":3,"n_rows":100,"n_cols":5,"rows_kept":100,"cut":false,"hidden":true,"merged":[]}
["Øvrige Krav",{"$f":"CONCATENATE(A1,\" - \",C6)","v":"Øvrige Krav - (Vælg)"}]
["Øvrige Krav"]
[]
[null,"Gemt/udskrevet af:",{"$f":"Forside!F32","v":"Niels Erik Bjergaarde (NEBG); nebg"},{"$f":"NOW()","v":"2019-10-22T15:28:04.130"}]
[]
[null,"Ydelseskategori","(Vælg)"]
[]
[]
[]
[]
[null,2,3,4]
[null,"Ydelsestype","Kravliste","Links"]
[{"$f":"CONCATENATE($C$6,E13)","v":"(Vælg)1"},{"$f":"IFERROR(IF(VLOOKUP($A13,Øvrige_Krav_DATA!$A:$D,B$11,FALSE)=0,\"\",VLOOKUP($A13,Øvrige_Krav_DATA!$A:$D,B$11,FALSE)),\"\")","v":""},{"$f":"IFERROR(IF(VLOOKUP($A13,Øvrige_Krav_DATA!$A:$D,C$11,FALSE)=0,\"\",VLOOKUP($A13,Øvrige_Krav_DATA!$A:$D,C$11,FALSE)),\"\")","v":""},{"$f":"IFERROR(IF(HYPERLINK(VLOOKUP($A13,Øvrige_Krav_DATA!$A:$D,D$11,FALSE),VLOOKUP($A13,Øvrige_Krav_DATA!$A:$D,D$11,FALSE))=0,\"\",HYPERLINK(VLOOKUP($A13,Øvrige_Krav_DATA!$A:$D,D$11,FALSE),VLOOKUP($A13,Øvrige_Krav_DATA!$A:$D,D$11,FALSE))),\"\")","v":""},1]
[{"$f":"CONCATENATE($C$6,E14)","v":"(Vælg)2"},{"$f":"IFERROR(IF(VLOOKUP($A14,Øvrige_Krav_DATA!$A:$D,B$11,FALSE)=0,\"\",VLOOKUP($A14,Øvrige_Krav_DATA!$A:$D,B$11,FALSE)),\"\")","v":""},{"$f":"IFERROR(IF(VLOOKUP($A14,Øvrige_Krav_DATA!$A:$D,C$11,FALSE)=0,\"\",VLOOKUP($A14,Øvrige_Krav_DATA!$A:$D,C$11,FALSE)),\"\")","v":""},{"$f":"IFERROR(IF(HYPERLINK(VLOOKUP($A14,Øvrige_Krav_DATA!$A:$D,D$11,FALSE),VLOOKUP($A14,Øvrige_Krav_DATA!$A:$D,D$11,FALSE))=0,\"\",HYPERLINK(VLOOKUP($A14,Øvrige_Krav_DATA!$A:$D,D$11,FALSE),VLOOKUP($A14,Øvrige_Krav_DATA!$A:$D,D$11,FALSE))),\"\")","v":""},2]
["(Vælg)3",{"$f":"IFERROR(IF(VLOOKUP($A15,Øvrige_Krav_DATA!$A:$D,B$11,FALSE)=0,\"\",VLOOKUP($A15,Øvrige_Krav_DATA!$A:$D,B$11,FALSE)),\"\")","v":""},{"$f":"IFERROR(IF(VLOOKUP($A15,Øvrige_Krav_DATA!$A:$D,C$11,FALSE)=0,\"\",VLOOKUP($A15,Øvrige_Krav_DATA!$A:$D,C$11,FALSE)),\"\")","v":""},{"$f":"IFERROR(IF(HYPERLINK(VLOOKUP($A15,Øvrige_Krav_DATA!$A:$D,D$11,FALSE),VLOOKUP($A15,Øvrige_Krav_DATA!$A:$D,D$11,FALSE))=0,\"\",HYPERLINK(VLOOKUP($A15,Øvrige_Krav_DATA!$A:$D,D$11,FALSE),VLOOKUP($A15,Øvrige_Krav_DATA!$A:$D,D$11,FALSE))),\"\")","v":""},3]
["(Vælg)4",{"$f":"IFERROR(IF(VLOOKUP($A16,Øvrige_Krav_DATA!$A:$D,B$11,FALSE)=0,\"\",VLOOKUP($A16,Øvrige_Krav_DATA!$A:$D,B$11,FALSE)),\"\")","v":""},{"$f":"IFERROR(IF(VLOOKUP($A16,Øvrige_Krav_DATA!$A:$D,C$11,FALSE)=0,\"\",VLOOKUP($A16,Øvrige_Krav_DATA!$A:$D,C$11,FALSE)),\"\")","v":""},{"$f":"IFERROR(IF(HYPERLINK(VLOOKUP($A16,Øvrige_Krav_DATA!$A:$D,D$11,FALSE),VLOOKUP($A16,Øvrige_Krav_DATA!$A:$D,D$11,FALSE))=0,\"\",HYPERLINK(VLOOKUP($A16,Øvrige_Krav_DATA!$A:$D,D$11,FALSE),VLOOKUP($A16,Øvrige_Krav_DATA!$A:$D,D$11,FALSE))),\"\")","v":""},4]
["(Vælg)5",{"$f":"IFERROR(IF(VLOOKUP($A17,Øvrige_Krav_DATA!$A:$D,B$11,FALSE)=0,\"\",VLOOKUP($A17,Øvrige_Krav_DATA!$A:$D,B$11,FALSE)),\"\")","v":""},{"$f":"IFERROR(IF(VLOOKUP($A17,Øvrige_Krav_DATA!$A:$D,C$11,FALSE)=0,\"\",VLOOKUP($A17,Øvrige_Krav_DATA!$A:$D,C$11,FALSE)),\"\")","v":""},{"$f":"IFERROR(IF(HYPERLINK(VLOOKUP($A17,Øvrige_Krav_DATA!$A:$D,D$11,FALSE),VLOOKUP($A17,Øvrige_Krav_DATA!$A:$D,D$11,FALSE))=0,\"\",HYPERLINK(VLOOKUP($A17,Øvrige_Krav_DATA!$A:$D,D$11,FALSE),VLOOKUP($A17,Øvrige_Krav_DATA!$A:$D,D$11,FALSE))),\"\")","v":""},5]
["(Vælg)6",{"$f":"IFERROR(IF(VLOOKUP($A18,Øvrige_Krav_DATA!$A:$D,B$11,FALSE)=0,\"\",VLOOKUP($A18,Øvrige_Krav_DATA!$A:$D,B$11,FALSE)),\"\")","v":""},{"$f":"IFERROR(IF(VLOOKUP($A18,Øvrige_Krav_DATA!$A:$D,C$11,FALSE)=0,\"\",VLOOKUP($A18,Øvrige_Krav_DATA!$A:$D,C$11,FALSE)),\"\")","v":""},{"$f":"IFERROR(IF(HYPERLINK(VLOOKUP($A18,Øvrige_Krav_DATA!$A:$D,D$11,FALSE),VLOOKUP($A18,Øvrige_Krav_DATA!$A:$D,D$11,FALSE))=0,\"\",HYPERLINK(VLOOKUP($A18,Øvrige_Krav_DATA!$A:$D,D$11,FALSE),VLOOKUP($A18,Øvrige_Krav_DATA!$A:$D,D$11,FALSE))),\"\")","v":""},6]
["(Vælg)7",{"$f":"IFERROR(IF(VLOOKUP($A19,Øvrige_Krav_DATA!$A:$D,B$11,FALSE)=0,\"\",VLOOKUP($A19,Øvrige_Krav_DATA!$A:$D,B$11,FALSE)),\"\")","v":""},{"$f":"IFERROR(IF(VLOOKUP($A19,Øvrige_Krav_DATA!$A:$D,C$11,FALSE)=0,\"\",VLOOKUP($A19,Øvrige_Krav_DATA!$A:$D,C$11,FALSE)),\"\")","v":""},{"$f":"IFERROR(IF(HYPERLINK(VLOOKUP($A19,Øvrige_Krav_DATA!$A:$D,D$11,FALSE),VLOOKUP($A19,Øvrige_Krav_DATA!$A:$D,D$11,FALSE))=0,\"\",HYPERLINK(VLOOKUP($A19,Øvrige_Krav_DATA!$A:$D,D$11,FALSE),VLOOKUP($A19,Øvrige_Krav_DATA!$A:$D,D$11,FALSE))),\"\")","v":""},7]
["(Vælg)8",{"$f":"IFERROR(IF(VLOOKUP($A20,Øvrige_Krav_DATA!$A:$D,B$11,FALSE)=0,\"\",VLOOKUP($A20,Øvrige_Krav_DATA!$A:$D,B$11,FALSE)),\"\")","v":""},{"$f":"IFERROR(IF(VLOOKUP($A20,Øvrige_Krav_DATA!$A:$D,C$11,FALSE)=0,\"\",VLOOKUP($A20,Øvrige_Krav_DATA!$A:$D,C$11,FALSE)),\"\")","v":""},{"$f":"IFERROR(IF(HYPERLINK(VLOOKUP($A20,Øvrige_Krav_DATA!$A:$D,D$11,FALSE),VLOOKUP($A20,Øvrige_Krav_DATA!$A:$D,D$11,FALSE))=0,\"\",HYPERLINK(VLOOKUP($A20,Øvrige_Krav_DATA!$A:$D,D$11,FALSE),VLOOKUP($A20,Øvrige_Krav_DATA!$A:$D,D$11,FALSE))),\"\")","v":""},8]
{"$rows_left_out":81}
{"sheet":"Øvrige_Krav_DATA","index":4,"n_rows":207,"n_cols":8,"rows_kept":207,"cut":false,"hidden":true,"merged":[]}
[null,null,null,null,null,null,null,"Dropdown - Øvrige Krav"]
[null,null,null,null,null,null,null,"(Vælg)"]
[null,null,null,null,null,null,null,"Faglige ydelser"]
[null,null,null,null,null,null,null,"Generelle krav om jernbanesikkerhed"]
[null,null,null,null,null,null,null,"Godkendelser og tilladelser"]
[null,null,null,null,null,null,null,"Jernbanesikkerhedsplaner"]
[null,null,null,null,null,null,null,"Krav om arbejdsmiljø"]
[null,null,null,null,null,null,null,"Krav om kontrakter og arbejdsvilkår"]
[null,null,null,null,null,null,null,"Krav om miljø"]
[null,null,null,null,null,null,null,"Kørsel"]
[null,null,null,null,null,null,null,"Rullende materiel"]
[null,null,null,null,null,null,null,"Sikkerhedsreglement (SR 75)"]
["Ydelseskategori","Ydelsestype","Kravliste","Links",null,null,null,"Togklargøring"]
["Godkendelser og tilladelser1","Gravetilladelse","Ansøgning om gravetilladelse","http://www.bane.dk/visArtikel.asp?artikelID=500 "]
["Godkendelser og tilladelser2",null,"Ansøgning om certificering ifm. opgravningsfri ledningsetablering","http://www.bane.dk/visArtikel.asp?artikelID=14011 "]
["Godkendelser og tilladelser3","Ibrugtagning af sikring og fjernstyring","Krav om en ibrugtagningsansvarlig af nye eller ændrede sikringsanlæg","http://www.bane.dk/visArtikel.asp?artikelID=19431 "]
["Godkendelser og tilladelser4","Godkendelse af bane/vej køretøjer","Banenorm BN2-74-1","http://www.bane.dk/db/filarkiv/5213/BN2-74-1.pdf "]
["Godkendelser og tilladelser5","Godkendelse af arbejdsmiljøkoordinator","Arbejdsmiljøuddannelse for koordinatorer af sikkerheds- og sundhedsarbejdet på bygge- og anlægspladser\nAT-vejledning F.2.3, marts 2006","https://arbejdstilsynet.dk/da/regler/at-vejledninger/a/f-2-3-arbejdsmiljoudd-for-koordinatorer "]
["Godkendelser og tilladelser6","Godkendelse af jernbanesikkerhedsplaner","Ansøgningsblanketter og vejledninger","http://www.bane.dk/visArtikel.asp?artikelID=23964&soegningID=675347&soegeord=jernbanesikkerhedsplaner "]
[]
{"$rows_left_out":188}
{"sheet":"Faglige kompetencekrav","index":5,"n_rows":8,"n_cols":5,"rows_kept":8,"cut":false,"hidden":true,"merged":[[6,2,6,4],[7,2,7,4],[5,2,5,4]]}
[null,{"$f":"CONCATENATE(\"Fagkompetencer \",C6,\" - \",IF(C8=\"\",C7,C8))","v":"Fagkompetencer (Vælg) - "}]
[{"$f":"\"Krav til fagkompetencer\"&IF(C6<>\"(Vælg)\",\" - \"&C6,)","v":"Krav til fagkompetencer"}]
[]
[null,"Gemt/udskrevet af:",{"$f":"Forside!F32","v":"Niels Erik Bjergaarde (NEBG); nebg"},null,{"$f":"NOW()","v":"2019-10-22T15:28:04.130"}]
[]
[null,"Fag","(Vælg)"]
[null,"Anlægselement"]
[null,"Anlægselementtype/opgave"]

{"sheet":"Fagkompetence_DATA","index":6,"n_rows":201,"n_cols":36,"rows_kept":201,"cut":false,"hidden":true,"merged":[]}
[]
[]
[]
[]
[]
[]
[]
[]
[null,0,1,2,3,4,5,6,7,8,9,10,null,null,"Opsætning",null,null,null,null,null,null,null,null,null,null,null,null,null,null,null,null,null,null,null,"Valglister (Må ikke redigeres)"]
[null,"Valgmenuer",null,null,"Nærmere beskrivelse:","Kompetencekrav","Kompetencekrav","Kompetencekrav","Kompetencekrav","Kompetencekrav",null,null,null,null,"Fag","(Vælg)","Forst","Sikring","Broer & bygninger","Kørestrøm","Stærkstrøm","Spor",null,null,null,null,null,null,null,null,null,null,null,null,"anlægselement","opgave/type"]
[null,"Fag","Anlægselement","Anlægselementtype/opgavetype","Opgavetype","Virksomheds krav","Grunduddannelse","Kurser","Certificering","Erfaring","Krav vedrører","Ansvar",null,null,"Benytter kolonner",null,"1,3,4,5,6,8,9,10","1,2,5,6,9,10","1,2,5,6,8,9,10","1,5,6,9,10","1,2,4,5,6,7,8,9,10","1,2,6,7,8,9,10",null,null,null,null,null,null,null,null,null,null,null,null,"(Vælg)","(Vælg)"]
[null,"Broer & bygninger","Broer_og_støttekonstruktioner","Særeftersyn (bro)",null,null,"Ingeniør med speciale i bærende konstruktioner og / eller broer samt evt. geoteknik.\n\n","VEJ-EU: Eftersyn af bygværker\nDykkerundersøgelser kræves certifikat som erhvervsdykker.",null,"Alt efter opgaven skal det bevises at de \"rigtige\" kompetencer er til stede hos teamet der skal løse opgaven.",null,null,null,null,null,null,null,null,null,null,null,null,null,null,null,null,null,null,null,null,null,null,null,null,"Fjernstyringscentral","Sicas S5"]
[null,"Broer & bygninger","Perron","Særeftersyn (perron)",null,null,"Ingeniør med speciale i bærende konstruktioner og / eller broer samt evt. geoteknik.\n\n","VEJ-EU: Eftersyn af bygværker\nDykkerundersøgelser kræves certifikat som erhvervsdykker.",null,"Alt efter opgaven skal det bevises at de \"rigtige\" kompetencer er til stede hos teamet der skal løse opgaven.",null,null,null,null,null,null,null,null,null,null,null,null,null,null,null,null,null,null,null,null,null,null,null,null,"Stationssikringsanlæg","1990_stat"]
[null,"Broer & bygninger","Store_broer","Særeftersyn (stor bro)",null,null,"Ingeniør med speciale i bærende konstruktioner og / eller broer samt evt. geoteknik.\n\n","VEJ-EU: Eftersyn af bygværker\nDykkerundersøgelser kræves certifikat som erhvervsdykker.",null,"Alt efter opgaven skal det bevises at de \"rigtige\" kompetencer er til stede hos teamet der skal løse opgaven.",null,null,null,null,null,null,null,null,null,null,null,null,null,null,null,null,null,null,null,null,null,null,null,null,"HKT_anlæg"]
[null,"Broer & bygninger","Broer_og_støttekonstruktioner","Generaleftersyn (bro)",null,null,"Ingeniør med speciale i bærende konstruktioner og / eller broer samt evt. geoteknik.\n","VEJ-EU: Eftersyn af bygværker",null,"Godt kendskab til brovedligehold og reperationsmetoder som kræves for at kunne deltage på kurset \"Eftersyn af bygværker\n\nSpecifikke krav om supplerende erfaring kan forekomme fx. erfaring med nittede stålbroer.",null,null,null,null,null,null,null,null,null,null,null,null,null,null,null,null,null,null,null,null,null,null,null,null,"Stationssikringsanlæg_varslingsanlæg"]
[null,"Broer & bygninger","Perron","Generaleftersyn (perron)",null,null,"Ingeniør med speciale i bærende konstruktioner og / eller broer samt evt. geoteknik.\n\n\n","VEJ-EU: Eftersyn af bygværker",null,"Godt kendskab til brovedligehold som kræves for at kunne deltage på kurset \"Eftersyn af bygværker\".",null,null,null,null,null,null,null,null,null,null,null,null,null,null,null,null,null,null,null,null,null,null,null,null,"SPSK_omstillingsanlæg"]
[null,"Sikring","Fjernstyringscentral","TCTC",null,null,"Sikringstekniker","Tonefjernstyring\n\nFKI_SKI Spor_sikring (ved elektrificerede strækning)",null,null,"Fagarbejdslederen","At arbejdet udføres i henhold til gældende normer og regler\n\nDet tekniske ansvar for arbejdet på arbejdsstedet\n\nSelvstændigt bedømme om jernbaneanlægget opfylder kravene i gældende normer og regler og kan idriftsættes efter indgreb",null,null,null,null,null,null,null,null,null,null,null,null,null,null,null,null,null,null,null,null,null,null,"Sporskiftedrev"]
[null,"Sikring","Stationssikringsanlæg","Sicas S5",null,null,"Sikringstekniker","Stationssikringsanlæg Sicas S5\n\nFKI_SKI Spor_sikring (ved elektrificerede strækning)",null,null,"Fagarbejdslederen","At arbejdet udføres i henhold til gældende normer og regler\n\nDet tekniske ansvar for arbejdet på arbejdsstedet\n\nSelvstændigt bedømme om jernbaneanlægget opfylder kravene i gældende normer og regler og kan idriftsættes efter indgreb",null,null,null,null,null,null,null,null,null,null,null,null,null,null,null,null,null,null,null,null,null,null,"Kabelanlæg"]
[null,"Sikring","HKT_anlæg","HKT-anlæg",null,null,"Sikringstekniker","Stationssikringsanlæg og linjeblok 69\n\nStationssikringsanlæg type 1964\n\nFKI_SKI Spor_sikring (ved elektrificerede strækning)",null,null,"Fagarbejdslederen","At arbejdet udføres i henhold til gældende normer og regler\n\nDet tekniske ansvar for arbejdet på arbejdsstedet\n\nSelvstændigt bedømme om jernbaneanlægget opfylder kravene i gældende normer og regler og kan idriftsættes efter indgreb",null,null,null,null,null,null,null,null,null,null,null,null,null,null,null,null,null,null,null,null,null,null,"Linieblokanlæg"]
[null,"Sikring","Stationssikringsanlæg","1990_stat",null,null,"Sikringstekniker","Stationssikringsanlæg 1990\n\nFKI_SKI Spor_sikring (ved elektrificerede strækning)",null,null,"Fagarbejdslederen","At arbejdet udføres i henhold til gældende normer og regler\n\nDet tekniske ansvar for arbejdet på arbejdsstedet\n\nSelvstændigt bedømme om jernbaneanlægget opfylder kravene i gældende normer og regler og kan idriftsættes efter indgreb",null,null,null,null,null,null,null,null,null,null,null,null,null,null,null,null,null,null,null,null,null,null,"Togdetektering"]
{"$rows_left_out":182}
{"sheet":"Versionshistorik","index":7,"n_rows":5,"n_cols":4,"rows_kept":5,"cut":false,"hidden":true,"merged":[]}
[]
["Index","Oprettet/Redigeret af","Ændringsbeskrivelse","Dato"]
[2,"MMIR","Funktionalitet til øvrige krav er fjernet fra arket. Det skal undersøges om øvrige krav har tilhørsforhol til kompentencekravkataloget","2019-09-12"]
["2.01","NEBG","Nyt Kompetencekravkatalog opdateret i samarbejde med fagansvarlige. Klar til BaneDK's hjemmeside","2019-10-11"]
["2.02","NEBG","Version, hvor pdf.fil genereringsfejl er rettet af Michael (MMIR)","2019-10-22"]